{"text_format":"1","workbook":"xlsx","n_sheets":4,"sheets":["Sheet1","Trough Data Fitting","Peak Trough Data Fitting","lookuparray"],"not_rendered":{"charts":4,"images":0,"macros":1,"external_links":0,"defined_names":98,"comments":3,"pivot_tables":0},"unopened":[],"bounds":{"document_bytes":16777216,"sheet_cells":100000,"rows_first":2000,"rows_last":500,"rows_between":2000,"halvings":0,"cell_chars":16384,"cell_head_chars":4096},"cells_cut":0,"cells_raw":0,"read":"whole","date_system":"1900"}

{"sheet":"Sheet1","index":0,"n_rows":119,"n_cols":30,"rows_kept":119,"cut":false,"hidden":true,"merged":[]}
[null,"Newton Raphson Method to solve for concentration at input time, Bolus Equation"]
[null,"Input Weight (kg)",70]
[null,"Calculated Vd",{"$f":"0.65*C2","v":45.5}]
[null,"Input Km(mg/l)",4]
[null,"Input Vmax mg/kg/day",7]
[null,"Vmax mg/hours",{"$f":"C5*C2/24","v":20.416666666666668}]
[null,"Calculated Vmax mg/hour/liter",{"$f":"C5*C2/(24*C3)","v":0.44871794871794873}]
[null,"Dose(mg)",1000,null,null,null,null,null,"Exact and Apporximate Soutions for Decades old MM equations","Explicit Reformulations of the Lambert W-omega function for calculation of solution to one compartment pk models with MM elimination kinetics"]
[null,"Calculated Cpo",{"$f":"C8/C3","v":21.978021978021978},null,null,null,null,null,"x of W equation"]
[null,"Input Time of Level ",24,null,null,null,null,null,{"$f":"(B13/C4)*EXP((C9-C7*C10)/C4)","v":90.554003283501928}]
[null,"Newton Raphson Method",null,"1st dervivative or Change in Y/Change in X",null,null,null,null,"value of lambert W equation","value of lambert w equation","x of lambert equation",null,null,null,null,null,null,null,null,null,null,null,"Newton Raphson Method Cp=C0e^(-kt)",null,"Slope"]
["Cold (initial then set as next old)","C initial(Dose/Vd)=Co","Fc=Co-C+Km*ln(Co) -Km*ln(C)-(Vmax/Vd)*time=0","F'C=-1-Km/C","Fc/F'C","Cnew",null,"Goal Seeker or solver of Explicit Equation",{"$f":"(1+0.4586887)*LN((6*I10)/(5*LN((12/5)*(I10/(LN(1+(12/15)*I10))))))-0.4586887*LN((2*I10)/(LN(1+2*I10)))","v":3.2165389328840095},{"$f":"1.4586887*LN(1.2*K12/(LN(2.4*K12/(LN(1+2.4*K12)))))-0.4586887*LN(2*K12/LN(1+2*K12))","v":3.3030764974777562},{"$f":"(B13/C4)*EXP((B13-C7*C10)/C4)","v":90.554003283501928},null,null,null,null,null,null,null,null,null,null,"Cold","C initial(Dose/Vd)=Co","Fc=Co*Exp(-k*time)","F'C=-c*k*exp((-k*Time)","Fc/F'C","Cnew","abs New-old"]
[1E-10,{"$f":"C9","v":21.978021978021978},{"$f":"$B$13-A13+$C$4*LN($B$13) -$C$4*LN(A13)-$C$7*$C$10","v":115.67236674055397},{"$f":"-1-$C$4/A13","v":-40000000001},{"$f":"C13/D13","v":-2.8918091684415541E-9},{"$f":"A13-E13","v":2.9918091684415541E-9},null,{"$f":"B13-H14+C4*LN(B13)-C4*LN(H14)-C7*C10","v":-8.076924470165963},{"$f":"C4*I12","v":12.866155731536038},"final value",null,null,null,null,null,null,null,null,null,null,"Initial",25,13.3,{"$f":"($W$13*EXP(-0.1*V13))","v":1.0917304816978541},{"$f":"(-0.1*$W$13)*EXP(-0.1*V13)","v":-0.10917304816978542},{"$f":"X13/Y13","v":-10},{"$f":"V13-Z13","v":35},{"$f":"AA13-V13","v":10}]
[{"$f":"F13","v":2.9918091684415541E-9},null,{"$f":"$B$13-A14+$C$4*LN($B$13) -$C$4*LN(A14)-$C$7*$C$10","v":102.07851325577766},{"$f":"-1-$C$4/A14","v":-1336983670.3439965},{"$f":"C14/D14","v":-7.6349857907773537E-8},{"$f":"A14-E14","v":7.9341667076215091E-8},null,19.719463017286131,null,{"$f":"C4*J12","v":13.212305989911025},null,null,null,null,null,null,null,null,null,null,null,{"$f":"AA13","v":35},null,{"$f":"($W$13*EXP(-0.1*V14))","v":0.40162519951683606},{"$f":"(-0.1*$W$13)*EXP(-0.1*V14)","v":-4.0162519951683608E-2},{"$f":"X14/Y14","v":-10},{"$f":"V14-Z14","v":45},{"$f":"AA14-V14","v":10}]
[{"$f":"F14","v":7.9341667076215091E-8},null,{"$f":"$B$13-A15+$C$4*LN($B$13) -$C$4*LN(A15)-$C$7*$C$10","v":88.966972582674202},-50414873.127121121,{"$f":"C15/D15","v":-1.7646969448548239E-6},{"$f":"A15-E15","v":1.844038611931039E-6},null,null,null,null,null,null,null,null,null,null,null,null,null,null,null,{"$f":"AA14","v":45},null,0.14774965395862269,-1.4774965395862268E-2,-10.000000000000002,55,10]
[1.844038611931039E-6,null,76.3831711521496,-2169152.976601663,-3.5213362992874979E-5,3.7057401604806019E-5,null,null,null,null,null,null,null,null,null,null,null,null,null,null,null,55,null,5.4354060131572089E-2,-5.4354060131572091E-3,-10,65,10]
[3.7057401604806019E-5,null,64.38109577455117,-107941.6495538326,-5.9644350480713251E-4,6.3350090641193851E-4,null,"Mathematical Modeling of Pharmacokinetic Data David WABourne p 39",null,null,null,null,null,null,null,null,null,null,null,null,null,65,null,1.9995741266601714E-2,-1.9995741266601716E-3,-10,75,10]
[6.3350090641193851E-4,null,53.025326029601274,-6315.1188268465894,-8.396568217241147E-3,9.030069123653086E-3,null,"Excel for Scientists and Engineers EJ Billo p154",null,null,null,null,null,null,null,null,null,null,null,null,null,75,null,7.3560221229661878E-3,-7.3560221229661878E-4,-10,85,10]
[9.030069123653086E-3,null,42.388713978540252,-443.9644939840519,-9.5477711738053861E-2,0.10450778086170695,null,null,null,null,null,null,null,null,null,null,null,null,null,null,null,85,null,2.7061293078415676E-3,-2.7061293078415677E-4,-10,95,10]
[0.10450778086170695,null,32.498430249399902,-39.274662106672416,-0.82746555937596999,0.93197334023767697,null,null,null,null,null,null,null,null,null,null,null,null,null,null,null,95,null,9.9552933750641798E-4,-9.9552933750641801E-5,-10,105,10]
[0.93197334023767697,null,22.91879395905794,-5.291968264864634,-4.3308638321254547,5.262837172363132,null,null,null,null,null,null,null,null,null,null,null,null,null,null,null,105,null,3.6623477635163722E-4,-3.6623477635163725E-5,-10,115,10]
[5.262837172363132,null,11.663444777673423,-1.7600463151330805,-6.6267828734901943,11.889620045853327,null,null,null,null,null,null,null,null,null,null,null,null,null,null,null,115,null,1.3473024486178846E-4,-1.3473024486178846E-5,-10,125,10]
[11.889620045853327,null,1.7766799573643546,-1.3364279080890442,-1.3294244654803908,13.219044511333719,null,null,null,null,null,null,null,null,null,null,null,null,null,null,null,125,null,4.9564487188646327E-5,-4.956448718864633E-6,-10,135,10]
[13.219044511333719,null,2.3284286296146206E-2,-1.302593731080222,-1.7875325007772672E-2,13.236919836341491,null,null,null,null,null,null,null,null,null,null,null,null,null,null,null,135,null,1.8233755848908324E-5,-1.8233755848908323E-6,-10,145,10]
[13.236919836341491,null,3.6538142591524547E-6,-1.30218510419759,-2.8059100410336399E-6,13.236922642251532,null,null,null,null,null,null,null,null,null,null,null,null,null,null,null,145,null,6.7078239121529114E-6,-6.7078239121529107E-7,-10.000000000000002,155,10]
[13.236922642251532,null,9.0594198809412774E-14,-1.3021850401415975,-6.9570910444157544E-14,13.236922642251601,null,null,null,null,null,null,null,null,null,null,null,null,null,null,null,155,null,2.4676705122792514E-6,-2.4676705122792516E-7,-10,165,10]
[13.236922642251601,null,0,-1.302185040141596,0,13.236922642251601,null,null,null,null,null,null,null,null,null,null,null,null,null,null,null,165,null,9.0780524905253775E-7,-9.0780524905253775E-8,-10,175,10]
[13.236922642251601,null,0,-1.302185040141596,0,13.236922642251601,null,null,null,null,null,null,null,null,null,null,null,null,null,null,null,175,null,3.3396288771394962E-7,-3.3396288771394959E-8,-10,185,10]
[13.236922642251601,null,0,-1.302185040141596,0,13.236922642251601,null,null,null,null,null,null,null,null,null,null,null,null,null,null,null,185,null,1.2285808050420891E-7,-1.2285808050420892E-8,-10,195,10]
[13.236922642251601,null,0,-1.302185040141596,0,13.236922642251601,null,null,null,null,null,null,null,null,null,null,null,null,null,null,null,195,null,4.5196961999284448E-8,-4.5196961999284448E-9,-10,205,10]
{"$rows_left_out":90}
{"sheet":"Trough Data Fitting","index":1,"n_rows":57,"n_cols":141,"rows_kept":57,"cut":false,"hidden":false,"merged":[[1,1,1,2],[23,1,23,2],[12,1,12,2]]}
[null,null,null,null,null,null,"Phenytoin Michaelis Menten (Capacity-Limited) Pharmacokinetics One Compartment Model "]
[null,"Demographic Data Input",null,null,null,null,"Bayesian Data Fitting of Troughs to Calculate Km and Vmax. Vd is not fit as peak levels are not entered or analyzed.",null,null,null,null,null,null,null,null,null,null,null,null,null,null,null,null,null,null,null,null,null,null,null,"Sex"]
[null,"Select Age Group (Years) Drop Down Box","> 59",null,null,null,"Dosing with or without a Loading Dose Followed by a  Uniform Dose and Frequency",null,null,null,null,null,null,null,null,null,null,null,null,null,null,null,null,null,null,null,null,null,null,null,"Male"]
[null,"Input Height (inches)",null,null,null,null,"Marshall Pierce PharmD",null,null,null,null,null,null,null,null,null,null,null,null,null,null,null,null,null,null,null,null,null,null,null,"Female"]
[null,"Input Weight (kg)",null,null,null,null,"https://pkineticdrugdosing.com/documents/phenytoin.html"]
[null,"Select Sex (Drop Down Box)","Male",null,null,"Instructions:"]
[null,"Input Serum Albumin (grams/dL) Normal is 4.4 g/dL",4.4000000000000004,null,null,"Enter information in the blue fields. Click new patient button to clear prior data."]
[null,"Select if Hemodialysis Patient (Drop Down Box)","No",null,null,"Enter the concentration before the first dose and the hours the level drawn before the first dose . "]
[null,"Select Dosage Form Drop Down Box","Capsule",null,null,"This assumes the patient was on prior therapy. If there was no prior therapy leave the cells blank."]
[null,"Fraction of Dosage Form That Is Pure Drug",{"$f":"IF(C9=\"Capsule\",0.92,IF(C9=\"Injection\",0.92,IF(C9=\"Tablet\",1,IF(C9=\"Suspension\",1))))","v":0.92},null,null,"Enter know troughs. The troughs below a dose are the trough just before the dose. Troughs should be drawn just before a dose."]
[null,"Ideal Body Weight (kg) calculated",{"$f":"IF(C6=\"Male\", (C4-60)*2.3+50,(C4-60)*2.3+45.5)","v":-88},null,null,"If extended release phenytoin capsules are being administered divide the total daily dose into 3 to 4 maintenance doses and set the Tau accordingly."]
[null,"Ideal Body Weight Used (kg)",{"$f":"IF(C5<C11,C5,C11)","v":-88}]
[null,"Population Mean Parameters",null,"Fit Parameters",null,"Data Fitting:"]
[null,"Calculated Vd (Liters)",{"$f":"IF(C5>C11,0.65*C12+1.33*(C5-C12),C5*0.65)","v":59.84},{"$f":"C14","v":59.84},null,"Click the fit data button."]
[null,"Km (mg/liter) population mean",{"$f":"VLOOKUP(C3,lookuparray!A2:F8,5,FALSE)","v":5.8},{"$f":"C15","v":5.8},null,"All doses are modeled as  bolus doses. If SR or extended release products are used divide the total daily dose into 3 to 4 doses and set the Tau accordingly. "]
[null,"Vmax (mg/kg/day) population mean",{"$f":"VLOOKUP(C3,lookuparray!A2:F8,4,FALSE)","v":7},{"$f":"D17/C12","v":7},null,"Fitting of levels after a loading dose.: Enter the loading dose, set Tau to a frequeny that repeats at time(s) of the post dose level(s), and set maintenance dose to 0. "]
[null,"Vmax Calculated (mg/day)",{"$f":"C16*C12","v":-616},{"$f":"D18*24","v":-616},null,"If prior therapy has been given you must have a pre Loading Dose level.  You can then fit the parameters after a loading dose.  Draw levels 6 and 12 hours post dose for data fitting.  "]
[null,"Vmax Calculated (mg/hours)",{"$f":"C16*C12/24","v":-25.666666666666668},{"$f":"D19*D14","v":-25.666666666666668},null,"After fitting levels enter a maintenance dose and adjust Tau as needed.  Order follow up levels ever 2 to 3 days."]
[null,"Vmax Calculated (mg/hour/liter)",{"$f":"C16*C12/(24*C14)","v":-0.42892156862745096},{"$f":"C19","v":-0.42892156862745096}]
[null,"Input Loaing Dose(mg) or enter the Maintenance Dose if no LD is given.",null,null,null,"Please review the information at the link above for a better understanding of phenytoin kinetics. "]
[null,"Cp Calculated Post Loading Dose(mg/L)",{"$f":"C20*C10/C14","v":0}]
[null,"Input Tau (Hours) ",null,null,null,"The graphic below demonstrates predicted levels using population parameters before levels are fit and patient specific after levels are fit."]
[null,"Input Maintenance Dose (mg)",null,{"$f":"IF(OR(D25<=0,D31>20),\"The dose it too high and is above or equal to Vmax. Reduce the dose or increase the interval.\",\"\")","v":{"$error":"#DIV/0!"}}]
[null,"Population Based Dosing",null,"Individualized Dosing"]
["hide","Predicted Cssavg Calculated (mg/L)",{"$f":"(C15*$C23*$C10/$C22)/(C18-$C23*$C10/$C22)","v":{"$error":"#DIV/0!"}},{"$f":"(D15*$C23*$C10/$C22)/(D18-$C23*$C10/$C22)","v":{"$error":"#DIV/0!"}}]
[null,"Accumulation",{"$f":"$C$23*$C$10/(C$14*(1-EXP(($C$23*$C$10-C$19*C$14*$C$22)/(C$15*C$14))))","v":{"$error":"#DIV/0!"}},{"$f":"$C$23*$C$10/(D$14*(1-EXP(($C$23*$C$10-D$19*D$14*$C$22)/(D$15*D$14))))","v":{"$error":"#DIV/0!"}}]
[null,"X of lamber equation calculated",{"$f":"(C26/C$15)*EXP((C26-C$19*$C$22)/C$15)","v":{"$error":"#DIV/0!"}},{"$f":"(D26/D$15)*EXP((D26-D$19*$C$22)/D$15)","v":{"$error":"#DIV/0!"}}]
[null,"Wo of x calculated",{"$f":"1.4586887*LN(1.2*C27/(LN(2.4*C27/(LN(1+2.4*C27)))))-0.4586887*LN(2*C27/(LN(1+2*C27)))","v":{"$error":"#DIV/0!"}},{"$f":"1.4586887*LN(1.2*D27/(LN(2.4*D27/(LN(1+2.4*D27)))))-0.4586887*LN(2*D27/(LN(1+2*D27)))","v":{"$error":"#DIV/0!"}}]
[null,"Predicted Css trough calculated (mg/L)",{"$f":"C$15*C28","v":{"$error":"#DIV/0!"}},{"$f":"D$15*D28","v":{"$error":"#DIV/0!"}}]
[null,"Predicted Css max calculated (mg/L)",{"$f":"C29+$C$23*$C$10/C$14","v":{"$error":"#DIV/0!"}},{"$f":"D29+$C$23*$C$10/D$14","v":{"$error":"#DIV/0!"}}]
{"$rows_left_out":28}
{"sheet":"Peak Trough Data Fitting","index":2,"n_rows":60,"n_cols":199,"rows_kept":60,"cut":false,"hidden":false,"merged":[[1,1,1,2],[12,1,12,2],[23,1,23,2]]}
[null,null,null,null,null,null,"Phenytoin Michaelis Menten (Capacity-Limited) Pharmacokinetics One Compartment Open Model "]
[null,"Demographic Data Input",null,null,null,null,"Bayesian Data Fitting of Steady State or Non Steady State Dosing and Serum Levels",null,null,null,null,null,null,null,null,null,null,null,null,null,null,null,null,null,null,null,null,null,null,null,"Sex"]
[null,"Select Age Group (Years) Drop Down Box","> 59",null,null,null,"Marshall Pierce PharmD",null,null,null,null,null,null,null,null,null,null,null,null,null,null,null,null,null,null,null,null,null,null,null,"Male"]
[null,"Input Height (inches)",70,null,null,null,"https://pkineticdrugdosing.com/documents/phenytoin.html",null,null,null,null,null,null,null,null,null,null,null,null,null,null,null,null,null,null,null,null,null,null,null,"Female"]
[null,"Input Weight (kg)",70]
[null,"Select Sex (Drop Down Box)","Male",null,null,"Instructions:"]
[null,"Input Serum Albumin (grams/dL) Normal is 4.4 g/dL",4.4000000000000004,null,null,"Click new patient button to clear prior data. Enter information in the blue fields. "]
[null,"Select if Hemodialysis Patient (Drop Down Box)","No",null,null,"If levels are to be analyzed enter the concentration before the first dose and time of level. "]
[null,"Select Dosage Form Drop Down Box","Capsule",null,null,"This assumes the patient was on prior therapy. If there was no prior therapy leave both cells blank."]
[null,"Fraction of Dosage Form That Is Pure Drug",{"$f":"IF(C9=\"Capsule\",0.92,IF(C9=\"Injection\",0.92,IF(C9=\"Tablet\",1,IF(C9=\"Suspension\",1))))","v":0.92},null,null,"Enter the dosing history including the dose and time for all doses that contribute to the serum levels to be analyzed. "]
[null,"Ideal Body Weight (kg) calculated",{"$f":"IF(C6=\"Male\", (C4-60)*2.3+50,(C4-60)*2.3+45.5)","v":73},null,null,"Dose and levels are enter chronologically from left to right. Levels should be enter after the dose that are associated with and before the next dose."]
[null,"Ideal Body Weight Used (kg)",{"$f":"IF(C5<C11,C5,C11)","v":70},null,null,"Enter know levels and time of levels. Peaks should be drawn 2 hours after end of a fos/phenytoin infusion."]
[null,"Population Mean Parameters",null,"Fit Parameters",null,"All does are modeled as bolus doses. If extended release phenytoin capsules are being administered divide "]
[null,"Calculated Vd (Liters)",{"$f":"IF(C5>C11,0.65*C12+1.33*(C5-C12),C5*0.65)","v":45.5},45.5,null,"the total daily dose into 3 to 4 maintenance doses and set the Tau accordingly."]
[null,"Km (mg/liter) population mean",{"$f":"VLOOKUP(C3,lookuparray!A2:F8,5,FALSE)","v":5.8},4.5302507722168048,null,"Data Fitting:"]
[null,"Vmax (mg/kg/day) population mean",{"$f":"VLOOKUP(C3,lookuparray!A2:F8,4,FALSE)","v":7},{"$f":"D17/C12","v":8.7924930854808672},null,"Select the type of fitting (1 without Vd, 2 with Vd). It is NOT recommended to fit Vd if a peak level was not drawn. Click the fit data button."]
[null,"Vmax Calculated (mg/day)",{"$f":"C16*C12","v":490},{"$f":"D18*24","v":615.47451598366069},null,"After fitting levels adjust the maintenance dose and Tau as needed to maintain therapeutic levels for individualized dosing.  "]
[null,"Vmax Calculated (mg/hours)",{"$f":"C16*C12/24","v":20.416666666666668},{"$f":"D19*D14","v":25.644771499319194},null,"Order follow up levels every 3-5 days."]
[null,"Vmax Calculated (mg/hour/liter)",{"$f":"C16*C12/(24*C14)","v":0.44871794871794873},0.56362135163338889,null,"Please review the information at the link above for a better understanding of phenytoin kinetics before using the calculator. "]
[null,"Input Loaing Dose(mg) ",1000,null,null,"No warranties are expressed or implied and the dosing tool is made available for for educational use."]
[null,"Calculated Post Loading Dose Level(mg/L)",{"$f":"C20*C10/C14","v":20.219780219780219}]
[null,"Input Dosage Interval, Tau (Hours) ",6,null,null,"The graphic below demonstrates predicted levels using population parameters before levels are fit and patient specific parameters after levels are fit for all doses entered."]
[null,"Input Maintenance Dose (mg)",100,{"$f":"IF(OR(D25<=0,D31>20),\"The dose it too high and is above or equal to Vmax. Reduce the dose or increase the interval.\",\"\")","v":""}]
[null,"Population Based Dosing",null,"Individualized Dosing"]
["hide","Predicted Cssavg Calculated (mg/L)",{"$f":"(C15*$C23*$C10/$C22)/(C18-$C23*$C10/$C22)","v":17.495081967213114},{"$f":"(D15*$C23*$C10/$C22)/(D18-$C23*$C10/$C22)","v":6.7365816538695862}]
[null,"Accumulation Factor",{"$f":"$C$23*$C$10/(C$14*(1-EXP(($C$23*$C$10-C$19*C$14*$C$22)/(C$15*C$14))))","v":18.525540665209036},{"$f":"$C$23*$C$10/(D$14*(1-EXP(($C$23*$C$10-D$19*D$14*$C$22)/(D$15*D$14))))","v":7.7980694413446541}]
[null,"X of lambert equation calculated",{"$f":"(C26/C$15)*EXP((C26-C$19*$C$22)/C$15)","v":48.967665515910134},{"$f":"(D26/D$15)*EXP((D26-D$19*$C$22)/D$15)","v":4.5628832688609844}]
[null,"Wo of x calculated",{"$f":"1.4586887*LN(1.2*C27/(LN(2.4*C27/(LN(1+2.4*C27)))))-0.4586887*LN(2*C27/(LN(1+2*C27)))","v":2.8404653786716247},{"$f":"1.4586887*LN(1.2*D27/(LN(2.4*D27/(LN(1+2.4*D27)))))-0.4586887*LN(2*D27/(LN(1+2*D27)))","v":1.274381635462527}]
[null,"Predicted Css trough calculated (mg/L)",{"$f":"C$15*C28","v":16.474699196295422},{"$f":"D$15*D28","v":5.7732683881530278}]
[null,"Predicted Css max calculated (mg/L)",{"$f":"C29+$C$23*$C$10/C$14","v":18.496677218273444},{"$f":"D29+$C$23*$C$10/D$14","v":7.7952464101310497}]
{"$rows_left_out":31}
{"sheet":"lookuparray","index":3,"n_rows":19,"n_cols":17,"rows_kept":19,"cut":false,"hidden":true,"merged":[]}
["Age","Age","Age","Vmax","Km","Vd","Maintenance Dose Range","Reference",null,null,"Salt","Sex","Dialysis","Km (mg/L)",null,"Fitting Type"]
["0.5 to < 1",0.5,0.99,14,6.6,1,"?","?",null,"Capsule",0.92,"Male","No",1,null,1,"Km Vmax"]
["1 to < 4",0.5,3.9,14,6.6,0.65,"?","Clinical Pharmacokinetics John E Murphy 2005",null,"Injection",0.92,"Female","Yes",2,null,2,"Km Vax Vd"]
["4 to < 7",4,6.9,10.9,6.8,0.65,"4-10","Clinical Pharmacokinetics John E Murphy 2005",null,"Suspension",1,null,null,3]
["7 to < 10",7,9.9,10.1,6.5,0.65,"4-10","Clinical Pharmacokinetics John E Murphy 2005",null,"Tablet",1,null,null,4]
["10 to < 18",10,17.899999999999999,8.3000000000000007,5.7,0.65,"4-10","Clinical Pharmacokinetics John E Murphy 2005",null,null,null,null,null,4.3]
["18 to 59",18,59,7,4.3,0.65,"4-7","Clinical Pharmacokinetics John E Murphy 2005",null,null,null,null,null,5]
["> 59",59.1,120,7,5.8,0.65,"4-7","Clinical Pharmacokinetics John E Murphy 2005",null,null,null,null,null,5.8]
[null,null,null,null,null,null,null,null,null,null,null,null,null,6]
[null,null,null,null,null,null,null,null,null,null,null,null,null,7]
["Age","Age","Age","Vmax","Km","SD Vmax","CV Vax","SD Km","CV Km",null,null,null,null,8]
["0.5 to < 1",0.5,3.9,14,6.6,4.2,{"$f":"F12/D12","v":0.3},4.2,{"$f":"H12/E12","v":0.63636363636363646},null,null,null,null,9]
["1 to < 4",1,3.9,14,6.6,4.2,{"$f":"F13/D13","v":0.3},4.2,{"$f":"H13/E13","v":0.63636363636363646},null,null,null,null,10]
["4 to < 7",4,6.9,10.9,6.8,3,0.27522935779816515,3.5,0.51470588235294124,null,null,null,null,11]
["7 to < 10",7,9.9,10.1,6.5,2.6,0.25742574257425743,3,0.46153846153846156,null,null,null,null,12]
["10 to < 18",10,17.899999999999999,8.3000000000000007,5.7,2.8,0.33734939759036142,2.7,0.47368421052631582,null,null,null,null,13]
["18 to 59",18,59,7,4.3,3,0.42857142857142855,3.5,0.81395348837209303,null,null,null,null,14]
["> 59",59.1,120,7,5.8,3,0.42857142857142855,2.2999999999999998,0.39655172413793099,null,null,null,null,15]
[null,null,null,null,null,null,null,null,null,null,null,null,null,16]